Starting a company
type: Concept
type: BusinessEvent
notation: 1
has rank order: 1
in scheme: business-event
preferred label: Unternehmensgründung @de
preferred label: Avvio impresa @it
definition: This business event groups public services related to the starting of a company
definition: Questo evento della vita di un'impresa racchiude nello specifico servizi pubblici relativi all'avvio di un'azienda @it