Starting a new activity
type: Concept
type: BusinessEvent
in scheme: business-event
notation: 2
preferred label: Neue berufliche Tätigkeit aufnehmen @de
preferred label: Avvio nuova attività professionale @it
definition: This business event groups public services related to the starting of a new business activity for single professionals
definition: Questo evento della vita di un'impresa racchiude nello specifico servizi pubblici relativi all'avvio di una nuova attività di business per singoli professionisti. @it
has rank order: 1