Staffing
type: BusinessEvent
has rank order: 1
in scheme: business-event
notation: 7
preferred label: Gestione personale @it
preferred label: Personalbesetzung @de
type: Concept
definition: Questo evento della vita di un'impresa raggruppa servizi pubblici relativi al reclutamento e alla gestione del personale di un'impresa. @it
definition: This business event groups public services related to the recruiting and management of employees of a company.