Gestione personale
type: BusinessEvent
type: Concept
definition: Questo evento della vita di un'impresa raggruppa servizi pubblici relativi al reclutamento e alla gestione del personale di un'impresa.
definition: This business event groups public services related to the recruiting and management of employees of a company. @en
in scheme: business-event
notation: 7
preferred label: Staffing @en
preferred label: Personalbesetzung @de
has rank order: 1