Pagamento tasse, iva e dogane
type: BusinessEvent
type: Concept
preferred label: Paying taxes (VAT and customs) @en
preferred label: Zahlung von Steuern (MwSt. und Zölle) @de
definition: Questo evento della vita di un'impresa raggruppa servizi pubblici relativi alla dichiarazione del profitto di un'impresa e quindi relativi al pagamento delle relative tasse (incluse iva e dogane).
definition: This business event groups public services related to declaring the profit of a company (and thus paying taxes, including VAT and customs). @en
notation: 8
in scheme: business-event
has rank order: 1