Reporting and notifying authorities
type: Concept
type: BusinessEvent
definition: This business event groups public services related to notifying authorities about different type of activities, for instance environmental information, annual reports, accounting procedures, registration of inventions, patents, trademarks, copyrights, etc.
definition: Questo evento della vita di un'impresa raggruppa servizi pubblici relativi alle notifiche alle autorità di diversi tipi di attività, ad esempio informazioni ambientali, relazioni annuali, procedure contabili, registrazioni di invenzioni, brevetti, ecc. @it
preferred label: Melde- und Notifizierungsbehörden @de
preferred label: Notifiche autorità @it
has rank order: 1
notation: 9
in scheme: business-event