Morte ed eredità
type: LifeEvent
type: Concept
definition: Questo evento della vita raggruppa servizi pubblici necessari quando una persona muore (per esempio notifica alle autorità, gestione del funerale, ecc.) e quelli relativi all'eredità e alle donazioni
definition: This life event groups public services that relate to when a relative passes a way, and cover the public services directly related to the decease of that person (for instance notifying the authorities, arranging the funeral…), as well as related to settling inheritance and donations. @en
in scheme: life-event
notation: 14
preferred label: Tod eines nahen Verwandten und/oder Einleitung eines Erbschaftsverfahrens @de
preferred label: Death of a close relative and/or starting an inheritance procedure @en
has rank order: 1