Denuncia crimini
type: LifeEvent
in scheme: life-event
definition: This life event groups public services related to a crime, for instance in case you are the committer of that crime, or the victim or witness of a particular crime. @en
preferred label: Meldung einer Straftat (kleinere Straftaten, z.B. Diebstahl, Einbruchdiebstahl, usw.) @de
type: Concept
preferred label: Reporting a crime (smaller offences, e.g., theft, burglary, etc) @en
has rank order: 1
notation: 16
definition: Questo evento della vita raggruppa servizi pubblici relativi a un crimine, per esempio nel caso in cui una persona è vittima o testimone di uno specifico crimine, ecc.