Reporting a crime (smaller offences, e.g., theft, burglary, etc)
type: LifeEvent
type: Concept
definition: This life event groups public services related to a crime, for instance in case you are the committer of that crime, or the victim or witness of a particular crime.
definition: Questo evento della vita raggruppa servizi pubblici relativi a un crimine, per esempio nel caso in cui una persona è vittima o testimone di uno specifico crimine, ecc. @it
in scheme: life-event
notation: 16
preferred label: Denuncia crimini @it
preferred label: Meldung einer Straftat (kleinere Straftaten, z.B. Diebstahl, Einbruchdiebstahl, usw.) @de
has rank order: 1