Iscrizione Scuola/Università e/o richiesta borsa di studio
type: Concept
has rank order: 1
definition: Questo evento della vita raggruppa qualsiasi servizio pubblico relativo all'educazione, per esempio l'educazione pre-scolastica, la scuola elementare, la scuola media e la scuola superiore, l'università, la borsa di studio, ...
in scheme: life-event
preferred label: Einschreibung in die Schule/Universität und/oder Bewerbung um ein Studienstipendium @de
preferred label: Enrolling in school/university and/or applying for a study grant @en
notation: 1
type: LifeEvent
definition: This life event groups any public service related to education, for example pre-school education, elementary school, higher education and university, a study grant, ... @en