Disability
type: Concept
definition: This life event groups public services related to a severe health problem, for instance getting disabled.
preferred label: Behinderung / Unfähigkeit @de
preferred label: Invalidità @it
in scheme: life-event
definition: Questo evento della vita raggruppa servizi pubblici relativi a seri problemi di salute come per esempio diventare disabile @it
type: LifeEvent
has rank order: 1
notation: 2