Looking for a job, starting a new job, becoming unemployed
type: LifeEvent
type: Concept
definition: This life event groups public services for when someone looks for a new job, starts a new job, leaves or quits a particular job on his own, or when someone loses his job
definition: Questo evento della vita raggruppa servizi pubblici utili a quelli che cercano un nuovo lavoro, iniziano un nuovo lavoro, lasciano un lavoro spontaneamente o perdono il lavoro @it
in scheme: life-event
notation: 3
preferred label: Arbeit suchen, einen neuen Job beginnen, arbeitslos werden @de
preferred label: Ricerca di lavoro, avvio nuovo lavoro, disoccupazione @it
has rank order: 1