Pensionamento
type: Concept
type: LifeEvent
definition: Questo evento della vita raggruppa servizi pubblici relativi al pensionamento di una persona
definition: This life event groups public services related to when someone retires from his job or becomes a senior. @en
notation: 4
preferred label: Retirement @en
preferred label: Pensionierung @de
in scheme: life-event
has rank order: 1