Registrazione/possesso veicolo
type: LifeEvent
type: Concept
definition: Questo evento della vita raggruppo servizi pubblici relativi alla registrazione e al possesso di un veicolo come una macchina, una moto, ecc.
definition: This life event groups public services related to the registration or the ownership of a vehicle such as a car, a motorcycle, etc. @en
in scheme: life-event
notation: 6
preferred label: Fahrzeugregistrierung/-besitz @de
preferred label: Registering/owning a vehicle @en
has rank order: 1