Cambio di residenza/domicilio
type: Concept
type: LifeEvent
definition: Questo evento della vita raggruppa servizi pubblici relativi al cambio di residenza o di domicilio sia per cittadini italiani sia per cittadini stranieri presenti nel territorio
definition: This life event groups public services related to moving or changing address both for Italian citizens and foreigns who are in the country @en
in scheme: life-event
notation: 9
preferred label: Wohnortwechsel/Domizilwechsel innerhalb eines Landes @de
preferred label: Moving and changing address within one country @en
has rank order: 1