Cultura e tempo libero
type: Concept
related match: https://w3id.org/italia/controlled-vocabulary/classifications-for-public-services/life-business-event/life-event/18
in scheme: public-services-subject-matters
definition: Questa materia include tutti quei servizi legati alla cultura e al tempo libero come per esempio i servizi di accesso ai luoghi della cultura e ogni altro luogo pubblico di carattere culturale ma anche accesso a luoghi dello sport o ogni altro servizi per le attività ricreative
has rank order: 1
related match: EDUC
notation: 10
alternative label: Cultura e tempo libero - luoghi della cultura, impianti sportivi