Ambiente
type: Concept
alternative label: Ambiente - rifiuti, verde urbano, incendi
definition: Questa materia include tutti quei servizi legati all'ambiente come per esempio gestione riufiuti, e verde urbano, denuncia di incendi e altri crimini contro il paesaggio
in scheme: public-services-subject-matters
notation: 11
has rank order: 1