Impresa e commercio
type: Concept
related match: https://w3id.org/italia/controlled-vocabulary/classifications-for-public-services/life-business-event/business-event/6
related match: https://w3id.org/italia/controlled-vocabulary/classifications-for-public-services/life-business-event/business-event/5
notation: 12
related match: https://w3id.org/italia/controlled-vocabulary/classifications-for-public-services/life-business-event/business-event/14
definition: Questa materia include tutti quei servizi di business legati alla vita dell'impresa e delle attività commerciali. Esempi includono la gestione dell'avvio e chiusura di un'azienda sia italiana che europea, la gestione del personale, la gestione di eventi quali la bancarotta
related match: https://w3id.org/italia/controlled-vocabulary/classifications-for-public-services/life-business-event/business-event/7
alternative label: Impresa e commercio - attività produttive, impresa nazionale/estera, notifiche, bancarotta, risorse umane
related match: https://w3id.org/italia/controlled-vocabulary/classifications-for-public-services/life-business-event/business-event/9
in scheme: public-services-subject-matters
has rank order: 1
related match: ECON
related match: https://w3id.org/italia/controlled-vocabulary/classifications-for-public-services/life-business-event/business-event/2
related match: https://w3id.org/italia/controlled-vocabulary/classifications-for-public-services/life-business-event/business-event/11
related match: https://w3id.org/italia/controlled-vocabulary/classifications-for-public-services/life-business-event/business-event/1
related match: https://w3id.org/italia/controlled-vocabulary/classifications-for-public-services/life-business-event/business-event/13
related match: https://w3id.org/italia/controlled-vocabulary/classifications-for-public-services/life-business-event/business-event/10
related match: https://w3id.org/italia/controlled-vocabulary/classifications-for-public-services/life-business-event/business-event/12
related match: https://w3id.org/italia/controlled-vocabulary/classifications-for-public-services/life-business-event/business-event/4