Autorizzazioni
type: Concept
in scheme: public-services-subject-matters
has rank order: 1
notation: 13
related match: https://w3id.org/italia/controlled-vocabulary/classifications-for-public-services/life-business-event/business-event/3
definition: Questa materia include tutti quei servizi legati alle imprese per richiedere permessi, licenze e finanziamenti
alternative label: Autorizzazioni - permessi, licenze, finanziamenti
related match: ECON