Appalti pubblici
type: Concept
in scheme: public-services-subject-matters
alternative label: Appalti pubblici - gare nazionali/estere, bandi
definition: Questa materia include tutti quei servizi legati agli appalti e bandi a cui le imprese possono partecipare, sia italiani che transfrontalieri
has rank order: 1
related match: https://w3id.org/italia/controlled-vocabulary/classifications-for-public-services/life-business-event/business-event/6
related match: https://w3id.org/italia/controlled-vocabulary/classifications-for-public-services/life-business-event/business-event/15
notation: 14
related match: GOVE