Appalti pubblici
type: Concept
alternative label: Appalti pubblici - gare nazionali/estere, bandi
definition: Questa materia include tutti quei servizi legati agli appalti e bandi a cui le imprese possono partecipare, sia italiani che transfrontalieri
in scheme: public-services-subject-matters
notation: 14
related match: 6
related match: 15
related match: GOVE
has rank order: 1