Educazione e formazione
type: Concept
alternative label: Educazione e formazione - nido, scuola, università
definition: Questa materia include tutti quei servizi relativi all'educazione di ogni livello e formazione anche universitaria
in scheme: public-services-subject-matters
notation: 1
related match: 1
related match: EDUC
has rank order: 1