Salute, benessere e assistenza
type: Concept
definition: Questa materia include tutti quei servizi relativi alla salute degli individui (e.g., prenotazione esami) ma anche tutti i servizi che riguardano l'assistenza e il benessere dei cittadini (e.g., servizi per invalidi, per anziani, per minori). Questo concetto include anche i servizi relativi agli animali
notation: 2
alternative label: Salute, benessere e assistenza - animali, invalidità, esami sanitari, anziani
related match: https://w3id.org/italia/controlled-vocabulary/classifications-for-public-services/life-business-event/life-event/2
related match: https://w3id.org/italia/controlled-vocabulary/classifications-for-public-services/life-business-event/life-event/19
related match: https://w3id.org/italia/controlled-vocabulary/classifications-for-public-services/life-business-event/life-event/15
related match: HEAL
related match: SOCI
has rank order: 1
in scheme: public-services-subject-matters