Vita lavorativa
type: Concept
alternative label: Vita lavorativa - lavoro, disoccupazione, pensione
related match: https://w3id.org/italia/controlled-vocabulary/classifications-for-public-services/life-business-event/life-event/4
related match: https://w3id.org/italia/controlled-vocabulary/classifications-for-public-services/life-business-event/life-event/3
related match: https://w3id.org/italia/controlled-vocabulary/classifications-for-public-services/life-business-event/business-event/7
related match: SOCI
in scheme: public-services-subject-matters
definition: Questa materia include tutti quei servizi legati a tutti gli eventi relativi alla vita lavorativa di cittadini, che possono riguardare il lavoro la disoccupazione e il pensionamento
has rank order: 1
notation: 3