Mobilità e trasporti
type: Concept
definition: Questa materia include tutti quei servizi sulla mobilità e sui trasporti, di ogni tipo.
notation: 4
related match: https://w3id.org/italia/controlled-vocabulary/classifications-for-public-services/life-business-event/life-event/7
has rank order: 1
related match: https://w3id.org/italia/controlled-vocabulary/classifications-for-public-services/life-business-event/life-event/6
related match: https://w3id.org/italia/controlled-vocabulary/classifications-for-public-services/life-business-event/life-event/5
in scheme: public-services-subject-matters
alternative label: Mobilità e trasporti - parcheggi, automobile, patente, trasporto pubblico