Anagrafe e stato civile
type: Concept
related match: https://w3id.org/italia/controlled-vocabulary/classifications-for-public-services/life-business-event/life-event/9
related match: https://w3id.org/italia/controlled-vocabulary/classifications-for-public-services/life-business-event/life-event/14
related match: SOCI
related match: https://w3id.org/italia/controlled-vocabulary/classifications-for-public-services/life-business-event/life-event/13
related match: https://w3id.org/italia/controlled-vocabulary/classifications-for-public-services/life-business-event/life-event/12
related match: https://w3id.org/italia/controlled-vocabulary/classifications-for-public-services/life-business-event/life-event/10
definition: Questa materia include tutti quei servizi dell'anagrafe e dello stato civile (per esempio, certificati anagrafici, matrimonio, residenza, domicilio, elezioni, espatrio)
has rank order: 1
notation: 6
alternative label: Anagrafe e stato civile - residenza, matrimonio, nascita, morte, espatrio, elezioni
in scheme: public-services-subject-matters