Anagrafe e stato civile
type: Concept
alternative label: Anagrafe e stato civile - residenza, matrimonio, nascita, morte, espatrio, elezioni
definition: Questa materia include tutti quei servizi dell'anagrafe e dello stato civile (per esempio, certificati anagrafici, matrimonio, residenza, domicilio, elezioni, espatrio)
in scheme: public-services-subject-matters
notation: 6
related match: 9
related match: 14
related match: SOCI
related match: 13
related match: 12
related match: 10
has rank order: 1