Turismo
type: Concept
related match: EDUC
related match: https://w3id.org/italia/controlled-vocabulary/classifications-for-public-services/life-business-event/life-event/11
notation: 7
definition: Questa materia include tutti quei servizi relativi alle attività turistiche e quindi principalmente ai viaggi e all'occorrente per effettuare un viaggio (e.g., visto)
has rank order: 1
in scheme: public-services-subject-matters
alternative label: Turismo - viaggi, passaporto, visto @en