Giustizia e sicurezza pubblica
type: Concept
definition: Questa materia include tutti quei servizi legati alla sicurezza pubblica come per esempio i servizi della protezione civile o i servizi di denuncia di crimi
has rank order: 1
in scheme: public-services-subject-matters
notation: 8
alternative label: Giustizia e sicurezza pubblica - crimini, protezione civile
related match: https://w3id.org/italia/controlled-vocabulary/classifications-for-public-services/life-business-event/life-event/16