Tributi, finanze e contravvenzioni
type: Concept
alternative label: Tributi, finanze e contravvenzioni - dichiarazione redditi, contributi
definition: Questa materia include tutti quei servizi legati alle tasse e alla finanza. Rientrano i servizi per la dichiarazione dei redditi, per il pagamento di contributi e contravvenzioni, ecc.
in scheme: public-services-subject-matters
notation: 9
related match: 17
related match: 8
related match: ECON
has rank order: 1