Istanza/Richiesta
type: Concept
definition: Questo è il solo elemento della classificazione che non può essere utilizzato come output del servizio
definition: This is the only item of the classification that cannot be used for the output of the service @en
in scheme: service-input-output
notation: REQ
preferred label: Request/application @en
preferred label: Gesuch/Anfrage @de
has rank order: 1