Festival
type: PublicEventTypology
has rank order: 3
in scheme: public-event-types
type: Concept
broader: https://w3id.org/italia/controlled-vocabulary/public-event-types/11
scope note: Nella versione deprecata 0.1 del vocabolario questo concetto corrisponde a https://w3id.org/italia/controlled-vocabulary/public-event-types/19_Festival
notation: 1.1.1
broader transitive: https://w3id.org/italia/controlled-vocabulary/public-event-types/1