Mostra
type: Concept
broader: https://w3id.org/italia/controlled-vocabulary/public-event-types/11
scope note: Nella versione deprecata 0.1 del vocabolario questo concetto corrisponde a https://w3id.org/italia/controlled-vocabulary/public-event-types/11_Exposure
notation: 1.1.2
definition: It can be used to indicate any art exposure @en
related match: VisualArtsEvent
in scheme: public-event-types
type: PublicEventTypology
broader transitive: https://w3id.org/italia/controlled-vocabulary/public-event-types/1
alternative label: Exibitions @en
alternative label: Mostre
preferred label: Exhibition @en
definition: Può indicare qualunque mostra d'arte
has rank order: 3