Spettacolo teatrale
type: Concept
alternative label: Theater @en
definition: All types of events regarding the theater are included in this concept (e.g., drama theater and any other show available at theaters) @en
in scheme: public-event-types
notation: 1.1.3
broader transitive: https://w3id.org/italia/controlled-vocabulary/public-event-types/1
broader: https://w3id.org/italia/controlled-vocabulary/public-event-types/11
alternative label: Teathral shows @en
definition: Tutti i tipi di eventi relativi al teatro rientrano in questo concetto (e.g., teatro di prosa, spettacoli di teatro in generale)
has rank order: 3
preferred label: Theathral show @en
alternative label: Teatro
scope note: Nella versione deprecata 0.1 del vocabolario questo concetto corrisponde a https://w3id.org/italia/controlled-vocabulary/public-event-types/15_TheathralShow
alternative label: Spettacoli teatrali
type: PublicEventTypology