Manifestazione musicale
type: Concept
broader transitive: https://w3id.org/italia/controlled-vocabulary/public-event-types/1
alternative label: Music events @en
in scheme: public-event-types
notation: 1.1.5
alternative label: Manifestazioni musicali
has rank order: 3
scope note: Nella versione deprecata 0.1 del vocabolario questo concetto corrisponde a https://w3id.org/italia/controlled-vocabulary/public-event-types/7_MusicEvent e a tutti i sotto eventi di questa voce.
alternative label: musica
definition: All types of events regarding music are included in this concept (e.g., music tour, music gala, auditions, etc.) @en
preferred label: Music event @en
alternative label: music @en
type: PublicEventTypology
broader: 11t
definition: Tutti i tipi di eventi che riguardano la musica rientrano in questo concetto (e.g., concerti, tour, galà, audizioni, ecc.)