Proiezione cinematografica
type: Concept
type: PublicEventTypology
alternative label: Proiezioni cinematografiche
alternative label: Cinema projections @en
broader: 11
broader transitive: 1
definition: All types of events and shows regarding cinema (also open cinema) are included in this concept @en
definition: Tutti i tipi di eventi e spettacoli riguardanti il cinema (e.g., anche cinema all'aperto) rientrano in questo concetto.
in scheme: public-event-types
notation: 1.1.8
preferred label: Cinema projection @en
scope note: Nella versione deprecata 0.1 del vocabolario questo concetto corrisponde a https://w3id.org/italia/controlled-vocabulary/public-event-types/17_CinemaProjection
has rank order: 3