Visita libera
type: Concept
broader transitive: https://w3id.org/italia/controlled-vocabulary/public-event-types/1
has rank order: 3
alternative label: Visite libere
alternative label: Free tours @en
notation: 1.1.9
scope note: Nella versione deprecata 0.1 del vocabolario questo concetto corrisponde a https://w3id.org/italia/controlled-vocabulary/public-event-types/111_FreeTour
preferred label: Free tour @en
in scheme: public-event-types
type: PublicEventTypology
broader: https://w3id.org/italia/controlled-vocabulary/public-event-types/11