Manifestazione artistica
type: Concept
alternative label: Manifestazioni artistiche
narrower: https://w3id.org/italia/controlled-vocabulary/public-event-types/114
broader: https://w3id.org/italia/controlled-vocabulary/public-event-types/1
definition: This concept includes public events such as concerts, theater shows, ballet event, readings, art exposition. @en
has rank order: 2
narrower: https://w3id.org/italia/controlled-vocabulary/public-event-types/117
narrower: https://w3id.org/italia/controlled-vocabulary/public-event-types/112
narrower: https://w3id.org/italia/controlled-vocabulary/public-event-types/111
narrower: https://w3id.org/italia/controlled-vocabulary/public-event-types/116
definition: Questo concetto include eventi pubblici che radunano/aggregano/richiamano pubblico interessato a fruire di prodotti culturali, siano essi intesi come prodotti culturali di 'arte alta' sia di 'arte popolare'. Per es. spettacoli teatrali anche amatoriali, ballo e danza classica ma non solo, letture pubbliche di libri, mostre d'arte ecc., spettacoli cinematografici, ecc.
notation: 1.1
in scheme: public-event-types
type: PublicEventTypology
narrower: https://w3id.org/italia/controlled-vocabulary/public-event-types/115
narrower: https://w3id.org/italia/controlled-vocabulary/public-event-types/118
narrower: https://w3id.org/italia/controlled-vocabulary/public-event-types/113
preferred label: Arts exhibition @en
narrower: https://w3id.org/italia/controlled-vocabulary/public-event-types/119