Laboratorio
type: Concept
preferred label: Workshop @en
in scheme: public-event-types
broader transitive: https://w3id.org/italia/controlled-vocabulary/public-event-types/1
notation: 1.2.4
type: PublicEventTypology
scope note: Nella versione deprecata 0.1 del vocabolario questo concetto corrisponde a https://w3id.org/italia/controlled-vocabulary/public-event-types/13_Conference
alternative label: Laboratori
broader: https://w3id.org/italia/controlled-vocabulary/public-event-types/12
has rank order: 3