Evento di formazione
type: Concept
definition: Questo concetto include eventi pubblici che radunano/aggregano/richiamano un pubblico interessato ad attività formative come corsi, scuole estive, webinar, workshop, seminari ecc.
narrower: https://w3id.org/italia/controlled-vocabulary/public-event-types/126
definition: This concept includes public events srelated to training (e.g., summer schools, webinars, workshops and seminars, etc.) @en
alternative label: Eventi di formazione
narrower: https://w3id.org/italia/controlled-vocabulary/public-event-types/121
has rank order: 2
preferred label: Training and workshop event @en
narrower: https://w3id.org/italia/controlled-vocabulary/public-event-types/123
type: PublicEventTypology
in scheme: public-event-types
notation: 1.2
narrower: https://w3id.org/italia/controlled-vocabulary/public-event-types/125
broader: https://w3id.org/italia/controlled-vocabulary/public-event-types/1
narrower: https://w3id.org/italia/controlled-vocabulary/public-event-types/124
narrower: https://w3id.org/italia/controlled-vocabulary/public-event-types/122
alternative label: Training and workshops @en