Convegno / Conferenza
type: Concept
has rank order: 3
related match: PublicationEvent
alternative label: Conferenze
alternative label: Convegni
related match: EducationEvent
preferred label: Conference @en
scope note: Nella versione deprecata 0.1 del vocabolario questo concetto corrisponde a https://w3id.org/italia/controlled-vocabulary/public-event-types/13_Conference
type: PublicEventTypology
in scheme: public-event-types
broader: https://w3id.org/italia/controlled-vocabulary/public-event-types/13
broader transitive: https://w3id.org/italia/controlled-vocabulary/public-event-types/1
notation: 1.3.1