Congresso
type: PublicEventTypology
has rank order: 3
alternative label: Congressi
notation: 1.3.3
broader transitive: https://w3id.org/italia/controlled-vocabulary/public-event-types/1
scope note: Nella versione deprecata 0.1 del vocabolario questo concetto corrisponde a https://w3id.org/italia/controlled-vocabulary/public-event-types/41_Summit
broader: https://w3id.org/italia/controlled-vocabulary/public-event-types/13
preferred label: Congress @en
in scheme: public-event-types
type: Concept