Conferenza e summit
type: PublicEventTypology
alternative label: Conferences and summits @en
broader: https://w3id.org/italia/controlled-vocabulary/public-event-types/1
definition: This concept includes public events such as conferences, summits, congresses and colloquiums. @en
narrower: https://w3id.org/italia/controlled-vocabulary/public-event-types/131
alternative label: Conferenze
type: Concept
preferred label: Conference and summit @en
has rank order: 2
in scheme: public-event-types
narrower: https://w3id.org/italia/controlled-vocabulary/public-event-types/133
notation: 1.3
narrower: https://w3id.org/italia/controlled-vocabulary/public-event-types/132
definition: Questo concetto include eventi pubblici che radunano/aggregano/richiamano un pubblico interessato a partecipare a conferenze e raduni quali che hanno finalità di presentazione e discussione di tematiche contemporanee su campi vari della cultura quali la scienza, l'economia, la tecnica, questioni sociali, non prevalentemente a scopi commerciali.
alternative label: Conferenze e summit