Info day
type: Concept
definition: This concept includes public events such as open days, information days, information meetings and networking events.
alternative label: Giornate informative @it
definition: Questo concetto include eventi pubblici come giornate aperte, giornate informative, incontri informativi e eventi di networking. @it
has rank order: 2
notation: 1.4
in scheme: public-event-types
type: PublicEventTypology
alternative label: Info days
narrower: https://w3id.org/italia/controlled-vocabulary/public-event-types/141
broader: https://w3id.org/italia/controlled-vocabulary/public-event-types/1
preferred label: Giornata informativa @it