Cerimonia
type: Concept
definition: Questo concetto include quindi anche le inaugurazioni e le assegnazioni di premi (e.g., David di Donatello, Premio Giornalistico, Premo Letterario, ecc.)
alternative label: Ceremonies @en
broader transitive: https://w3id.org/italia/controlled-vocabulary/public-event-types/2
definition: This concept includes then the inauguration events and the award (e.g., 'David di Donatello', Literary prize, Journalism prize) @en
broader: https://w3id.org/italia/controlled-vocabulary/public-event-types/21
alternative label: Cerimonie
preferred label: Ceremony @en
notation: 2.1.1
scope note: Nella versione deprecata 0.1 del vocabolario questo concetto corrisponde a https://w3id.org/italia/controlled-vocabulary/public-event-types/114_Award e https://w3id.org/italia/controlled-vocabulary/public-event-types/34_Inauguration
type: PublicEventTypology
in scheme: public-event-types
has rank order: 3