Competition and award ceremony
type: PublicEventTypology
narrower: https://w3id.org/italia/controlled-vocabulary/public-event-types/211
definition: This concept includes public events such as award ceremonies, competitions and contests.
alternative label: Competitions and award ceremonies
narrower: https://w3id.org/italia/controlled-vocabulary/public-event-types/212
alternative label: Concorsi e cerimonie @it
has rank order: 2
preferred label: Concorso e cerimonia @it
broader: https://w3id.org/italia/controlled-vocabulary/public-event-types/2
notation: 2.1
definition: Questo concetto include eventi pubblici come cerimonie di premiazione, competizioni e concorsi. @it
in scheme: public-event-types
type: Concept