Forum
type: PublicEventTypology
broader transitive: https://w3id.org/italia/controlled-vocabulary/public-event-types/2
scope note: Nella versione deprecata 0.1 del vocabolario questo concetto corrisponde a https://w3id.org/italia/controlled-vocabulary/public-event-types/42_Forum
notation: 2.2.2
has rank order: 3
in scheme: public-event-types
type: Concept
broader: https://w3id.org/italia/controlled-vocabulary/public-event-types/22