Dibattito pubblico
type: PublicEventTypology
broader: https://w3id.org/italia/controlled-vocabulary/public-event-types/2
narrower: https://w3id.org/italia/controlled-vocabulary/public-event-types/221
definition: Questo concetto include eventi pubblici come dibattiti pubblici, dialoghi, forum e incontri pubblici, prevalentemente finalizzati attorno a temi relativi a questioni civiche, sociali.
alternative label: Dibattiti pubblici
alternative label: Public debates @en
type: Concept
definition: This concept includes public events such as public debates, dialogues, forums and public meetings. @en
has rank order: 2
notation: 2.2
preferred label: Public Debate @en
in scheme: public-event-types
narrower: https://w3id.org/italia/controlled-vocabulary/public-event-types/222