Incontro con esperti
type: Concept
definition: This concept includes public events such as expert meetings, general meetings and stakeholder meetings. @en
narrower: https://w3id.org/italia/controlled-vocabulary/public-event-types/231
has rank order: 2
in scheme: public-event-types
type: PublicEventTypology
alternative label: Partner meetings @en
definition: Questo concetto include eventi pubblici come incontri con esperti, riunioni generali e incontri con i portatori di interesse.
narrower: https://w3id.org/italia/controlled-vocabulary/public-event-types/232
preferred label: Partner meeting @en
alternative label: Incontri con gli esperti
broader: https://w3id.org/italia/controlled-vocabulary/public-event-types/2
notation: 2.3