Torneo Storico / Palio
type: PublicEventTypology
preferred label: Historical Tournament @en
type: Concept
broader transitive: https://w3id.org/italia/controlled-vocabulary/public-event-types/2
notation: 2.4.3
has rank order: 3
broader: https://w3id.org/italia/controlled-vocabulary/public-event-types/24
in scheme: public-event-types
scope note: Nella versione deprecata 0.1 del vocabolario questo concetto corrisponde a https://w3id.org/italia/controlled-vocabulary/public-event-types/36_HistoricalTournament
alternative label: Tornei storici